Category:Free software programmed in C
type: Concept
same as: Category:Free software programmed in C
pref label: Free software programmed in C
label: Free software programmed in C
broader: Category:C (programming language) software
broader: Category:Free software by programming language
was derived from: http://en.wikipedia.org/wiki/Category:Free_software_programmed_in_C
description: উইকিমিডিয়া বিষয়শ্রেণী @bn
description: ویکیمیڈیا زمرہ @ur
description: Wikimedia:Klassys @kw
description: Викимедиа проектындагы төркем @tt
description: উইকিমিডিয়া থাক @bpy
description: ẹ̀ka Wikimedia @yo
description: 위키미디어 분류 @ko
description: Wikimedia:Ronnaghys @gv
description: विकिमिडिया श्रेणी @ne
description: Wikimediako kategoria @eu
description: Wikimedia:ကဏ္ဍခွဲခြင်း @my
description: Viciméid catagóir @ga
description: Wikimedia category
description: Wikimedia kategooria @et
description: kawan Wikimèdia @ace
description: κατηγορία εγχειρημάτων Wikimedia @el
description: катэгорыя ў праекце Вікімедыя @be
description: Уикимедия категория @bg
description: pajenn rummata eus Wikimedia @br
description: Wikimedia категориясы @ky
description: categoria Vicimediorum @la
description: категорияд Ангилал @mn
description: Викимедија категорија @sr
description: Vikimedya kategorisi @tr
description: categoria di un progetto Wikimedia @it
description: kategori Wikimedia @ms
description: קטגוריה בוויקיפדיה @iw
description: categoria de Wikimedia @ca
description: Wikimedia-kategori @da
description: Wikimedia-Kategorie @bar
description: categoría de Wikimedia @an
description: tumbung Wikimedia @bjn
description: kategori Wikimédia @su
description: Vikipidiya:Shopni @rmy
description: Викимедиа категорияһы @ba
description: tudalen categori Wikimedia @cy
description: kategoria ti Wikimedia @ilo
description: categurìa 'e nu pruggette Wikimedia @nap
description: 維基媒體分類 @yue
description: زمرو:وڪيپيڊيا زمرا بندي @sd
description: விக்கிமீடியப் பகுப்பு @ta
description: Wikimedia-categorie @nl
description: kategorija na Wikimediji @hr
description: ვიკიპედია:კატეგორიზაცია @ka
description: Wikimedia-kategory @fy
description: Wikimedia-bólkur @fo
description: kategorija Wikimedie @sl
description: kategória projektov Wikimedia @sk
description: kategorya ng Wikimedia @tl
description: kategorio en Vikimedio @eo
description: විකිමීඩියා ප්‍රභේද පිටුව @si
description: 维基媒体项目分类 @zh
description: гурӯҳи Викимедиа @tg
description: വിക്കിമീഡിയ വർഗ്ഗം @ml
description: د ويکيمېډيا وېشنيزه @ps
description: หน้าหมวดหมู่วิกิมีเดีย @th
description: jamii ya Wikimedia @sw
description: page de catégorie d'un projet Wikimedia @fr
description: Wikimedia:Kategorija @hbs
description: Վիքիմեդիայի նախագծի կատեգորիա @hy
description: विकिपीडिया वर्ग @mr
description: विकिमीडिया श्रेणी @hi
description: تصنيف بتاع ويكيميديا @arz
description: વિકિપીડિયા શ્રેણી @gu
description: Wikimedia projekta kategorija @lv
description: категорія проєкту Вікімедіа @uk
description: Wîkîmediya:Kategorî @ku
description: تصنيف ويكيميديا @ar
description: thể loại Wikimedia @vi
description: ৱিকিমিডিয়াৰ শ্ৰেণী @as
description: categoria Wikimedia @ia
description: Wikimédia-kategória @hu
description: Vikimédia ñemohenda @gn